MeTA make failed in Windows


#1

Got the following errors:

267 | return U_IS_LEAD© ? INERT : UCPTRIE_FAST_GET(normTrie, UCPTRIE_16, c);
make[4]: Making all' ingencfu’
generating dependency information for C:/msys64/home/bryce/meta/build/deps/icu-63.1/src/ExternalICU/source/tools/gencfu/gencfu.cpp
config.status: creating tools/gencfu/gencfu.1
make[4]: Making all' ingendict’
generating dependency information for C:/msys64/home/bryce/meta/build/deps/icu-63.1/src/ExternalICU/source/tools/gendict/gendict.cpp
config.status: creating tools/gendict/gendict.1
make[4]: Making all' inescapesrc’
generating dependency information for C:/msys64/home/bryce/meta/build/deps/icu-63.1/src/ExternalICU/source/tools/escapesrc/escapesrc.cpp
make[3]: Making all' indata’
mkdir -p ./out ./out/build ./out/build/icudt63l ./out/build/icudt63l/curr ./out/build/icudt63l/lang ./out/build/icudt63l/region ./out/build/icudt63l/zone ./out/build/icudt63l/unit ./out/build/icudt63l/brkitr ./out/build/icudt63l/coll ./out/build/icudt63l/rbnf ./out/build/icudt63l/translit ./out/tmp ./out/tmp/curr ./out/tmp/lang ./out/tmp/region ./out/tmp/zone ./out/tmp/unit ./out/tmp/coll ./out/tmp/rbnf ./out/tmp/translit ./out/tmp/brkitr
Unpacking C:/msys64/home/bryce/meta/build/deps/icu-63.1/src/ExternalICU/source/data/in/icudt63l.dat and generating out/tmp/icudata.lst (list of data files)
/bin/sh: -c: line 0: syntax error near unexpected token (' /bin/sh: -c: line 0:PATH=…/stubdata:…/tools/ctestfw:…/lib:$PATH …/bin/pkgdata -O …/data/icupkg.inc -q -c -s Microsoft Windows [Version 10.0.18362.418] © 2019 Microsoft Corporation. All rights reserved. C:/msys64/home/bryce/meta/build/deps/icu-63.1/src/ExternalICU-build/data>/out/build/icudt63l -d …/lib -e icudt63 -T ./out/tmp -p icudt63l -m static -r 63 -L icudt ./out/tmp/icudata.lst’
make[4]: *** [Makefile:193: packagedata] Error 1
make[3]: *** [Makefile:153: all-recursive] Error 2
make[2]: *** [CMakeFiles/ExternalICU.dir/build.make:117: deps/icu-63.1/src/ExternalICU-stamp/ExternalICU-build] Error 2
make[1]: *** [CMakeFiles/Makefile2:107: CMakeFiles/ExternalICU.dir/all] Error 2
make: *** [Makefile:130: all] Error 2