MacOS 10.14.2 Install Fails at make


#1

Running the CXX… command works then running make produces the following:

[ 1%] No patch step for ‘ExternalICU’
[ 1%] No update step for ‘ExternalICU’
[ 1%] Performing configure step for ‘ExternalICU’
checking for ICU version numbers… release 58.2, library 58.2, unicode version 9.0
checking build system type… x86_64-apple-darwin18.2.0
checking host system type… x86_64-apple-darwin18.2.0
checking whether to build debug libraries… no
checking whether to build release libraries… yes
checking whether the C compiler works… yes
checking for C compiler default output file name… a.out
checking for suffix of executables…
checking whether we are cross compiling… configure: error: in ‘/Users/chase/Projects/Tools/meta/meta/build/deps/icu-58.2/src/ExternalICU-build’:
configure: error: cannot run C compiled programs.
If you meant to cross compile, use ‘–host’.
See ‘config.log’ for more details
make[2]: *** [deps/icu-58.2/src/ExternalICU-stamp/ExternalICU-configure] Error 1
make[1]: *** [CMakeFiles/ExternalICU.dir/all] Error 2
make: *** [all] Error 2

I have tried some googling, but I’m new to C++ etc. Thanks for the help!