Install fails on Ubuntu 18.04.01 LTS


#1

Dear Support,

I have followed the install guide for ubuntu 14.04, but the install fails first during cmake, failing to find doxygen, then during make at 16% with following message:

ole@ole-HP-EliteBook-2570p:~/meta/build$ make
[ 2%] Built target ExternalICU
[ 3%] Built target meta-util
[ 4%] Built target meta-utf
[ 5%] Built target meta-tokenizers
[ 6%] Built target meta-io
[ 10%] Built target meta-filters
[ 13%] Built target meta-corpus
[ 15%] Built target meta-analyzers
[ 16%] Linking CXX executable …/…/…/tokenize-test
/usr/bin/ld: cannot find -licu
collect2: error: ld returned 1 exit status
src/analyzers/tools/CMakeFiles/tokenize-test.dir/build.make:104: recipe for target ‘tokenize-test’ failed
make[2]: *** [tokenize-test] Error 1
CMakeFiles/Makefile2:413: recipe for target ‘src/analyzers/tools/CMakeFiles/tokenize-test.dir/all’ failed
make[1]: *** [src/analyzers/tools/CMakeFiles/tokenize-test.dir/all] Error 2
Makefile:129: recipe for target ‘all’ failed
make: *** [all] Error 2