Error in Windows 10 during "make" command please help


#1

Getting below error while running “make” on windows 10, please help.
– MD5 hash of
D:/msys64/home/jraval/meta/deps/icu-58.2/icu4c-58_2-src.tgz
does not match expected value
expected: ‘fac212b32b7ec7ab007a12dff1f3aea1’
actual: ‘fc6d5400af92a3bd74914660ee2b5caf’
– Hash mismatch, removing…

Below is the console message generated for “make” command:

jraval@LINMB257 MINGW64 ~/meta/build
$ make
[ 1%] Performing download step (download, verify and extract) for ‘ExternalICU’
– Downloading…
dst=‘D:/msys64/home/jraval/meta/deps/icu-58.2/icu4c-58_2-src.tgz’
timeout=‘none’
– Using src=‘http://download.icu-project.org/files/icu4c/58.2/icu4c-58_2-src.tgz
– [download 100% complete]
– verifying file…
file=‘D:/msys64/home/jraval/meta/deps/icu-58.2/icu4c-58_2-src.tgz’
– MD5 hash of
D:/msys64/home/jraval/meta/deps/icu-58.2/icu4c-58_2-src.tgz
does not match expected value
expected: ‘fac212b32b7ec7ab007a12dff1f3aea1’
actual: ‘f3a9cceb2fc1bea983eb54bf8b49d2a7’
– Hash mismatch, removing…
– Retry after 60 seconds (attempt #5) …
– Using src=‘http://download.icu-project.org/files/icu4c/58.2/icu4c-58_2-src.tgz
– [download 100% complete]
– verifying file…
file=‘D:/msys64/home/jraval/meta/deps/icu-58.2/icu4c-58_2-src.tgz’
– MD5 hash of
D:/msys64/home/jraval/meta/deps/icu-58.2/icu4c-58_2-src.tgz
does not match expected value
expected: ‘fac212b32b7ec7ab007a12dff1f3aea1’
actual: ‘0f9a63e99d32d28bdd9b9c099220e8f1’
– Hash mismatch, removing…
CMake Error at ExternalICU-stamp/download-ExternalICU.cmake:159 (message):
Each download failed!

make[2]: *** [CMakeFiles/ExternalICU.dir/build.make:111: deps/icu-58.2/src/ExternalICU-stamp/ExternalICU-download] Error 1
make[1]: *** [CMakeFiles/Makefile2:1342: CMakeFiles/ExternalICU.dir/all] Error 2
make: *** [Makefile:150: all] Error 2